dream-n
type: LexicalEntry
canonical form: dream
sense: 05776550-n
part of speech: noun

dreaming-n
type: LexicalEntry
canonical form: dreaming
sense: 05776550-n
part of speech: noun

05776550-n
type: LexicalConcept
in scheme: en-word.net
definition: a series of mental images and emotions occurring during sleep
example: I had a dream about you last night
ili: i67207
lexfile: noun.cognition
part of speech: noun
hypernym: 05775730-n