typification-n
type: LexicalEntry
canonical form: typification
sense: 05773898-n
part of speech: noun

exemplification-n
type: LexicalEntry
canonical form: exemplification
sense: 05773898-n
part of speech: noun

05773898-n
type: LexicalConcept
in scheme: en-word.net
definition: a representational or typifying form or model
ili: i67195
lexfile: noun.cognition
part of speech: noun
hypernym: 05773156-n