reproduction-n
type: LexicalEntry
canonical form: reproduction
sense: 05770480-n
part of speech: noun

reproductive memory-n
type: LexicalEntry
canonical form: reproductive memory
sense: 05770480-n
part of speech: noun

05770480-n
type: LexicalConcept
in scheme: en-word.net
definition: recall that is hypothesized to work by storing the original stimulus input and reproducing it during recall
ili: i67181
lexfile: noun.cognition
part of speech: noun
hypernym: 05769556-n