star topology-n
type: LexicalEntry
canonical form: star topology
sense: 05738875-n
part of speech: noun

star-n
type: LexicalEntry
canonical form: star
sense: 05738875-n
part of speech: noun

05738875-n
type: LexicalConcept
in scheme: en-word.net
definition: the topology of a network whose components are connected to a hub
ili: i67022
lexfile: noun.cognition
part of speech: noun
hypernym: 05738310-n