constriction-n
type: LexicalEntry
canonical form: constriction
sense: 05729675-n
part of speech: noun

tightness-n
type: LexicalEntry
canonical form: tightness
sense: 05729675-n
part of speech: noun

05729675-n
type: LexicalConcept
in scheme: en-word.net
definition: a tight feeling in some part of the body
example: he felt a constriction in her chest
example: she felt an alarming tightness in her chest
example: emotion caused a constriction of his throat
ili: i66977
lexfile: noun.cognition
part of speech: noun
hypernym: 05729447-n