detection-n
type: LexicalEntry
canonical form: detection
sense: 05718634-n
part of speech: noun

sensing-n
type: LexicalEntry
canonical form: sensing
sense: 05718634-n
part of speech: noun

05718634-n
type: LexicalConcept
in scheme: en-word.net
definition: the perception that something has occurred or some state exists
example: early detection can often lead to a cure
ili: i66922
lexfile: noun.cognition
part of speech: noun
hypernym: 05716379-n