abstractedness-n
type: LexicalEntry
canonical form: abstractedness
sense: 05708590-n
part of speech: noun

abstraction-n
type: LexicalEntry
canonical form: abstraction
sense: 05708590-n
part of speech: noun

05708590-n
type: LexicalConcept
in scheme: en-word.net
definition: preoccupation with something to the exclusion of all else
ili: i66868
lexfile: noun.cognition
part of speech: noun
hypernym: 05708052-n