unconsciousness-n
type: LexicalEntry
canonical form: unconsciousness
sense: 05686773-n
part of speech: noun

05686773-n
type: LexicalConcept
in scheme: en-word.net
definition: a state lacking normal awareness of the self or environment
ili: i66760
lexfile: noun.cognition
part of speech: noun
hypernym: 05677778-n