part-n
type: LexicalEntry
canonical form: part
sense: 05679818-n
part of speech: noun

05679818-n
type: LexicalConcept
in scheme: en-word.net
definition: that which concerns a person with regard to a particular role or situation
example: it requires vigilance on our part
example: they resisted every effort on his part
ili: i66724
lexfile: noun.cognition
part of speech: noun
hypernym: 05678554-n