heritage-n
type: LexicalEntry
canonical form: heritage
sense: 05677641-n
part of speech: noun

05677641-n
type: LexicalConcept
in scheme: en-word.net
definition: practices that are handed down from the past by tradition
example: a heritage of freedom
ili: i66712
lexfile: noun.cognition
part of speech: noun
hypernym: 05675040-n