practice-n
type: LexicalEntry
canonical form: practice
sense: 05675040-n
part of speech: noun

05675040-n
type: LexicalConcept
in scheme: en-word.net
definition: knowledge of how something is usually done
example: it is not the local practice to wear shorts to dinner
ili: i66699
lexfile: noun.cognition
part of speech: noun
hypernym: 00023451-n