discipline-n
type: LexicalEntry
canonical form: discipline
sense: 05670721-n
part of speech: noun

05670721-n
type: LexicalConcept
in scheme: en-word.net
definition: a system of rules of conduct or method of practice
example: he quickly learned the discipline of prison routine
example: for such a plan to work requires discipline
ili: i66677
lexfile: noun.cognition
part of speech: noun
hypernym: 05669841-n