excitability-n
type: LexicalEntry
canonical form: excitability
sense: 05661555-n
part of speech: noun

irritability-n
type: LexicalEntry
canonical form: irritability
sense: 05661555-n
part of speech: noun

05661555-n
type: LexicalConcept
in scheme: en-word.net
definition: excessive sensitivity of an organ or body part
ili: i66630
lexfile: noun.cognition
part of speech: noun
hypernym: 05661420-n