concoction-n
type: LexicalEntry
canonical form: concoction
sense: 05642064-n
part of speech: noun

05642064-n
type: LexicalConcept
in scheme: en-word.net
definition: the invention of a scheme or story to suit some purpose
example: his testimony was a concoction
example: she has no peer in the concoction of mystery stories
ili: i66516
lexfile: noun.cognition
part of speech: noun
hypernym: 05641230-n