vegetation-n
type: LexicalEntry
canonical form: vegetation
sense: 05611609-n
part of speech: noun

05611609-n
type: LexicalConcept
in scheme: en-word.net
definition: an abnormal growth or excrescence (especially a warty excrescence on the valves of the heart)
ili: i66359
lexfile: noun.body
part of speech: noun
hypernym: 05611405-n