digit-n
type: LexicalEntry
canonical form: digit
sense: 05573730-n
part of speech: noun

dactyl-n
type: LexicalEntry
canonical form: dactyl
sense: 05573730-n
part of speech: noun

05573730-n
type: LexicalConcept
in scheme: en-word.net
definition: a finger or toe in human beings or corresponding body part in other vertebrates
ili: i66160
lexfile: noun.body
part of speech: noun
hypernym: 05567541-n
mero part: 05286083-n
mero part: 05589324-n