leg-n
type: LexicalEntry
canonical form: leg
sense: 05568420-n
part of speech: noun

05568420-n
type: LexicalConcept
in scheme: en-word.net
definition: a human limb; commonly used to refer to a whole limb but technically only the part of the limb between the knee and ankle
ili: i66137
lexfile: noun.body
part of speech: noun
hypernym: 05567877-n
mero part: 05384187-n
mero part: 05387077-n
mero part: 05391643-n
mero part: 05569023-n
mero part: 05569882-n
mero part: 05570389-n
mero part: 05570535-n
mero part: 05570899-n
mero part: 05575508-n
mero part: 05575982-n
mero part: 05581233-n
mero part: 05586073-n
mero part: 05599011-n
mero part: 05601792-n
mero part: 05601956-n
mero part: 05602122-n
mero part: 14583575-n