frill-n
type: LexicalEntry
canonical form: frill
sense: 05554630-n
part of speech: noun

ruff-n
type: LexicalEntry
canonical form: ruff
sense: 05554630-n
part of speech: noun

05554630-n
type: LexicalConcept
in scheme: en-word.net
definition: an external body part consisting of feathers or hair about the neck of a bird or other animal
ili: i66068
lexfile: noun.body
part of speech: noun
hypernym: 05232383-n