anus-n
type: LexicalEntry
canonical form: anus
sense: 05545649-n
part of speech: noun

05545649-n
type: LexicalConcept
in scheme: en-word.net
definition: the excretory opening at the end of the alimentary canal
ili: i66021
lexfile: noun.body
part of speech: noun
domain topic: 00845915-n
domain topic: 14878134-n
hypernym: 05257118-n
mero part: 05579344-n