diaphragm-n
type: LexicalEntry
canonical form: diaphragm
sense: 05326156-n
part of speech: noun

midriff-n
type: LexicalEntry
canonical form: midriff
sense: 05326156-n
part of speech: noun

05326156-n
type: LexicalConcept
in scheme: en-word.net
definition: (anatomy) a muscular partition separating the abdominal and thoracic cavities; functions in respiration
ili: i64908
lexfile: noun.body
part of speech: noun
domain topic: 06067070-n
hypernym: 05469392-n
hypernym: 05433820-n