premolar-n
type: LexicalEntry
canonical form: premolar
sense: 05314857-n
part of speech: noun

bicuspid-n
type: LexicalEntry
canonical form: bicuspid
sense: 05314857-n
part of speech: noun

05314857-n
type: LexicalConcept
in scheme: en-word.net
definition: a tooth having two cusps or points; located between the incisors and the molars
ili: i64847
lexfile: noun.body
part of speech: noun
hypernym: 05290245-n