muscle-n
type: LexicalEntry
canonical form: muscle
sense: 05296796-n
part of speech: noun

musculus-n
type: LexicalEntry
canonical form: musculus
sense: 05296796-n
part of speech: noun

05296796-n
type: LexicalConcept
in scheme: en-word.net
definition: one of the contractile organs of the body
ili: i64755
lexfile: noun.body
part of speech: noun
hypernym: 05297100-n
mero part: 05466808-n