scab-n
type: LexicalEntry
canonical form: scab
sense: 05271746-n
part of speech: noun

05271746-n
type: LexicalConcept
in scheme: en-word.net
definition: the crustlike surface of a healing skin lesion
ili: i64628
lexfile: noun.body
part of speech: noun
hypernym: 05271580-n