bang-n
type: LexicalEntry
canonical form: bang
sense: 05266468-n
part of speech: noun

fringe-n
type: LexicalEntry
canonical form: fringe
sense: 05266468-n
part of speech: noun

05266468-n
type: LexicalConcept
in scheme: en-word.net
definition: a border of hair that is cut short and hangs across the forehead
ili: i64591
lexfile: noun.body
part of speech: noun
hypernym: 05264345-n