crimp-n
type: LexicalEntry
canonical form: crimp
sense: 05265782-n
part of speech: noun

05265782-n
type: LexicalConcept
in scheme: en-word.net
definition: a lock of hair that has been artificially waved or curled
ili: i64586
lexfile: noun.body
part of speech: noun
hypernym: 05265220-n