down-n
type: LexicalEntry
canonical form: down
sense: 05263175-n
part of speech: noun

pile-n
type: LexicalEntry
canonical form: pile
sense: 05263175-n
part of speech: noun

05263175-n
type: LexicalConcept
in scheme: en-word.net
definition: fine soft dense hair (as the fine short hair of cattle or deer or the wool of sheep or the undercoat of certain dogs)
ili: i64571
lexfile: noun.body
part of speech: noun
hypernym: 05262259-n