blowhole-n
type: LexicalEntry
canonical form: blowhole
sense: 05257902-n
part of speech: noun

05257902-n
type: LexicalConcept
in scheme: en-word.net
definition: the spiracle of a cetacean located far back on the skull
ili: i64545
lexfile: noun.body
part of speech: noun
hypernym: 05257792-n