passage-n
type: LexicalEntry
canonical form: passage
sense: 05255524-n
part of speech: noun

passageway-n
type: LexicalEntry
canonical form: passageway
sense: 05255524-n
part of speech: noun

05255524-n
type: LexicalConcept
in scheme: en-word.net
definition: a path or channel or duct through or along which something may pass
example: the nasal passages
ili: i64535
lexfile: noun.body
part of speech: noun
hypernym: 05232895-n