meaninglessness-n
type: LexicalEntry
canonical form: meaninglessness
sense: 05181322-n
part of speech: noun

05181322-n
type: LexicalConcept
in scheme: en-word.net
definition: the quality of having no value or significance
example: he resented the meaninglessness of the tasks they assigned him
ili: i64168
lexfile: noun.attribute
part of speech: noun
hypernym: 05181106-n