advantage-n
type: LexicalEntry
canonical form: advantage
sense: 05163204-n
part of speech: noun

vantage-n
type: LexicalEntry
canonical form: vantage
sense: 05163204-n
part of speech: noun

05163204-n
type: LexicalConcept
in scheme: en-word.net
definition: the quality of having a superior or more favorable position
example: the experience gave him the advantage over me
ili: i64076
lexfile: noun.attribute
part of speech: noun
hypernym: 05161764-n