competence-n
type: LexicalEntry
canonical form: competence
sense: 05160767-n
part of speech: noun

competency-n
type: LexicalEntry
canonical form: competency
sense: 05160767-n
part of speech: noun

05160767-n
type: LexicalConcept
in scheme: en-word.net
definition: the quality of being adequately or well qualified physically and intellectually
ili: i64064
lexfile: noun.attribute
part of speech: noun
hypernym: 05207437-n