realism-n
type: LexicalEntry
canonical form: realism
sense: 05159116-n
part of speech: noun

pragmatism-n
type: LexicalEntry
canonical form: pragmatism
sense: 05159116-n
part of speech: noun

05159116-n
type: LexicalConcept
in scheme: en-word.net
definition: the attribute of accepting the facts of life and favoring practicality and literal truth
ili: i64055
lexfile: noun.attribute
part of speech: noun
hypernym: 05158335-n