demerit-n
type: LexicalEntry
canonical form: demerit
sense: 05146359-n
part of speech: noun

fault-n
type: LexicalEntry
canonical form: fault
sense: 05146359-n
part of speech: noun

05146359-n
type: LexicalConcept
in scheme: en-word.net
definition: the quality of being inadequate or falling short of perfection
example: they discussed the merits and demerits of her novel
example: he knew his own faults much better than she did
ili: i63994
lexfile: noun.attribute
part of speech: noun
hypernym: 05145473-n