length-n
type: LexicalEntry
canonical form: length
sense: 05140372-n
part of speech: noun

05140372-n
type: LexicalConcept
in scheme: en-word.net
definition: the property of being the extent of something from beginning to end
example: the editor limited the length of my article to 500 words
ili: i63962
lexfile: noun.attribute
part of speech: noun
hypernym: 05130681-n