number-n
type: LexicalEntry
canonical form: number
sense: 05128718-n
part of speech: noun

figure-n
type: LexicalEntry
canonical form: figure
sense: 05128718-n
part of speech: noun

05128718-n
type: LexicalConcept
in scheme: en-word.net
definition: the property possessed by a sum or total or indefinite quantity of units or individuals
example: the number of parameters is small
example: the figure was about a thousand
ili: i63904
lexfile: noun.attribute
part of speech: noun
hypernym: 05115065-n