stuffiness-n
type: LexicalEntry
canonical form: stuffiness
sense: 05119774-n
part of speech: noun

closeness-n
type: LexicalEntry
canonical form: closeness
sense: 05119774-n
part of speech: noun

05119774-n
type: LexicalConcept
in scheme: en-word.net
definition: the quality of being close and poorly ventilated
ili: i63862
lexfile: noun.attribute
part of speech: noun
hypernym: 04731092-n