probability-n
type: LexicalEntry
canonical form: probability
sense: 05098974-n
part of speech: noun

chance-n
type: LexicalEntry
canonical form: chance
sense: 05098974-n
part of speech: noun

05098974-n
type: LexicalConcept
in scheme: en-word.net
definition: a measure of how likely it is that some event will occur; a number expressing the ratio of favorable cases to the whole number of cases possible
example: the probability that an unbiased coin will fall with the head up is 0.5
example: if that phone call is for me, chances are it's my wife
ili: i63752
lexfile: noun.attribute
part of speech: noun
hypernym: 00033914-n