alignment-n
type: LexicalEntry
canonical form: alignment
sense: 05084315-n
part of speech: noun

05084315-n
type: LexicalConcept
in scheme: en-word.net
definition: the spatial property possessed by an arrangement or position of things in a straight line or in parallel lines
ili: i63674
lexfile: noun.attribute
part of speech: noun
hypernym: 05082771-n