composition-n
type: LexicalEntry
canonical form: composition
sense: 05083641-n
part of speech: noun

composing-n
type: LexicalEntry
canonical form: composing
sense: 05083641-n
part of speech: noun

05083641-n
type: LexicalConcept
in scheme: en-word.net
definition: the spatial property resulting from the arrangement of parts in relation to each other and to the whole
example: harmonious composition is essential in a serious work of art
ili: i63671
lexfile: noun.attribute
part of speech: noun
hypernym: 05082771-n