pace-n
type: LexicalEntry
canonical form: pace
sense: 05065731-n
part of speech: noun

rate-n
type: LexicalEntry
canonical form: rate
sense: 05065731-n
part of speech: noun

05065731-n
type: LexicalConcept
in scheme: en-word.net
definition: the relative speed of progress or change
example: he lived at a fast pace
example: he works at a great rate
example: the pace of events accelerated
ili: i63582
lexfile: noun.attribute
part of speech: noun
hypernym: 05051679-n