spark advance-n
type: LexicalEntry
canonical form: spark advance
sense: 05058239-n
part of speech: noun

lead-n-1
type: LexicalEntry
canonical form: lead
sense: 05058239-n
part of speech: noun

05058239-n
type: LexicalConcept
in scheme: en-word.net
definition: the timing of ignition relative to the position of the piston in an internal-combustion engine
ili: i63541
lexfile: noun.attribute
part of speech: noun
hypernym: 05053160-n