sufferance-n
type: LexicalEntry
canonical form: sufferance
sense: 05039950-n
part of speech: noun

05039950-n
type: LexicalConcept
in scheme: en-word.net
definition: patient endurance especially of pain or distress
ili: i63448
lexfile: noun.attribute
part of speech: noun
hypernym: 05039720-n