harshness-n
type: LexicalEntry
canonical form: harshness
sense: 04995915-n
part of speech: noun

roughness-n
type: LexicalEntry
canonical form: roughness
sense: 04995915-n
part of speech: noun

04995915-n
type: LexicalConcept
in scheme: en-word.net
definition: the quality of being harsh or rough or grating to the senses
ili: i63218
lexfile: noun.attribute
part of speech: noun
hypernym: 04786888-n