tameness-n
type: LexicalEntry
canonical form: tameness
sense: 04913019-n
part of speech: noun

domestication-n
type: LexicalEntry
canonical form: domestication
sense: 04913019-n
part of speech: noun

04913019-n
type: LexicalConcept
in scheme: en-word.net
definition: the attribute of having been domesticated
ili: i62768
lexfile: noun.attribute
part of speech: noun
attribute: https://en-word.net/synset/02396713-a
hypernym: 04912365-n