perturbation-n
type: LexicalEntry
canonical form: perturbation
sense: 04912173-n
part of speech: noun

fluster-n
type: LexicalEntry
canonical form: fluster
sense: 04912173-n
part of speech: noun

04912173-n
type: LexicalConcept
in scheme: en-word.net
definition: a disposition that is confused or nervous and upset
ili: i62764
lexfile: noun.attribute
part of speech: noun
hypernym: 04911841-n