disarray-n
type: LexicalEntry
canonical form: disarray
sense: 04904781-n
part of speech: noun

disorderliness-n
type: LexicalEntry
canonical form: disorderliness
sense: 04904781-n
part of speech: noun

04904781-n
type: LexicalConcept
in scheme: en-word.net
definition: untidiness (especially of clothing and appearance)
ili: i62724
lexfile: noun.attribute
part of speech: noun
hypernym: 04904605-n