error-n
type: LexicalEntry
canonical form: error
sense: 04860996-n
part of speech: noun

wrongdoing-n
type: LexicalEntry
canonical form: wrongdoing
sense: 04860996-n
part of speech: noun

04860996-n
type: LexicalConcept
in scheme: en-word.net
definition: departure from what is ethically acceptable
ili: i62493
lexfile: noun.attribute
part of speech: noun
hypernym: 04859319-n