pitilessness-n
type: LexicalEntry
canonical form: pitilessness
sense: 04838495-n
part of speech: noun

ruthlessness-n
type: LexicalEntry
canonical form: ruthlessness
sense: 04838495-n
part of speech: noun

04838495-n
type: LexicalConcept
in scheme: en-word.net
definition: mercilessness characterized by a lack of pity
ili: i62382
lexfile: noun.attribute
part of speech: noun
hypernym: 04838262-n