freshness-n
type: LexicalEntry
canonical form: freshness
sense: 04807845-n
part of speech: noun

novelty-n
type: LexicalEntry
canonical form: novelty
sense: 04807845-n
part of speech: noun

04807845-n
type: LexicalConcept
in scheme: en-word.net
definition: originality by virtue of being refreshingly novel
ili: i62230
lexfile: noun.attribute
part of speech: noun
hypernym: 04807608-n