rationality-n
type: LexicalEntry
canonical form: rationality
sense: 04792206-n
part of speech: noun

rationalness-n
type: LexicalEntry
canonical form: rationalness
sense: 04792206-n
part of speech: noun

04792206-n
type: LexicalConcept
in scheme: en-word.net
definition: the quality of being consistent with or based on logic
ili: i62152
lexfile: noun.attribute
part of speech: noun
hypernym: 04791892-n